{"text_format":"1","workbook":"xlsx","n_sheets":4,"sheets":["男子エントリー","女子エントリー","参加人数集計","データテーブル"],"not_rendered":{"charts":0,"images":2,"macros":0,"external_links":0,"defined_names":2,"comments":2,"pivot_tables":0},"unopened":[],"bounds":{"document_bytes":16777216,"sheet_cells":100000,"rows_first":2000,"rows_last":500,"rows_between":2000,"halvings":0,"cell_chars":16384,"cell_head_chars":4096},"cells_cut":0,"cells_raw":0,"read":"whole","date_system":"1900"}

{"sheet":"男子エントリー","index":0,"n_rows":56,"n_cols":48,"rows_kept":56,"cut":false,"hidden":false,"merged":[[49,0,49,30],[51,0,51,30],[53,1,53,2],[55,8,55,18],[55,19,55,20],[55,21,55,29],[45,2,45,7],[45,8,45,13],[46,2,46,7],[46,8,46,13],[47,0,47,1],[47,2,47,7],[47,8,47,13],[39,0,46,0],[41,8,41,13],[42,2,42,7],[42,8,42,13],[43,2,43,7],[43,8,43,13],[44,2,44,7],[44,8,44,13],[39,2,39,7],[39,8,39,13],[40,2,40,7],[40,8,40,13],[41,2,41,7],[33,8,33,13],[34,2,34,7],[34,8,34,13],[35,2,35,7],[35,8,35,13],[36,2,36,7],[36,8,36,13],[29,0,38,0],[29,2,29,7],[29,8,29,13],[30,2,30,7],[30,8,30,13],[31,2,31,7],[31,8,31,13],[32,2,32,7],[32,8,32,13],[33,2,33,7],[37,2,37,7],[37,8,37,13],[38,2,38,7],[38,8,38,13],[19,0,28,0],[19,2,19,7],[19,8,19,13],[20,2,20,7],[20,8,20,13],[21,2,21,7],[21,8,21,13],[22,2,22,7],[26,2,26,7],[26,8,26,13],[27,2,27,7],[27,8,27,13],[28,2,28,7],[28,8,28,13],[22,8,22,13],[23,2,23,7],[23,8,23,13],[24,2,24,7],[24,8,24,13],[25,2,25,7],[25,8,25,13],[13,8,13,13],[14,0,18,1],[14,2,14,7],[14,8,14,13],[15,2,15,7],[15,8,15,13],[16,2,16,7],[16,8,16,13],[17,2,17,7],[17,8,17,13],[9,0,13,1],[9,2,9,7],[9,8,9,13],[10,2,10,7],[10,8,10,13],[11,2,11,7],[11,8,11,13],[12,2,12,7],[12,8,12,13],[13,2,13,7],[18,2,18,7],[18,8,18,13],[6,22,6,30],[8,0,8,1],[8,2,8,7],[8,8,8,13],[8,17,8,23],[8,24,8,30],[4,20,4,21],[4,22,4,30],[5,0,5,1],[5,3,5,16],[5,17,6,19],[5,20,5,21],[5,22,5,30],[6,0,6,1],[6,3,6,16],[6,20,6,21],[0,0,0,25],[0,26,2,30],[2,0,2,1],[2,3,2,16],[3,0,4,1],[3,3,3,16],[3,17,4,19],[3,20,3,21],[3,22,3,30],[4,3,4,16],[0,32,0,48],[37,33,38,33],[19,36,20,36],[7,33,7,37],[7,39,7,47],[21,36,22,36],[23,36,24,36],[25,36,26,36],[27,36,28,36],[29,36,30,36],[31,36,32,36],[33,36,34,36],[35,36,36,36],[37,36,38,36],[19,33,20,33],[21,33,22,33],[23,33,24,33],[25,33,26,33],[27,33,28,33],[29,33,30,33],[31,33,32,33],[33,33,34,33],[35,33,36,33]]}
["３０　少林寺拳法競技　参加申込書　（新人）",null,null,null,null,null,null,null,null,null,null,null,null,null,null,null,null,null,null,null,null,null,null,null,null,null,"男子",null,null,null,null,null,"非表示セルあり"]
[]
["学校名"]
["学校所在地",null,"〒",{"$f":"IF($D$3=\"\",\"\",VLOOKUP($D$3,データテーブル!$A$2:$G$71,3,0))","v":""},null,null,null,null,null,null,null,null,null,null,null,null,null,"監　督",null,null,"氏名"]
[null,null,null,{"$f":"IF($D$3=\"\",\"\",VLOOKUP($D$3,データテーブル!$A$2:$G$71,4,0))","v":""},null,null,null,null,null,null,null,null,null,null,null,null,null,null,null,null,"ＴＥＬ"]
["ＴＥＬ",null,null,{"$f":"IF($D$3=\"\",\"\",VLOOKUP($D$3,データテーブル!$A$2:$G$71,5,0))","v":""},null,null,null,null,null,null,null,null,null,null,null,null,null,"引率教員",null,null,"氏名"]
["ＦＡＸ",null,null,{"$f":"IF($D$3=\"\",\"\",VLOOKUP($D$3,データテーブル!$A$2:$G$71,6,0))","v":""},null,null,null,null,null,null,null,null,null,null,null,null,null,null,null,null,"ＴＥＬ"]
[null,null,null,null,null,null,null,null,null,null,null,null,null,null,null,null,null,null,null,null,null,null,null,null,null,null,null,null,null,null,null,null,null,"監督会議　抽選会資料用",null,null,null,null,null,"出場選手マスター用"]
["出場種目",null,"選手名",null,null,null,null,null,"ふりがな",null,null,null,null,null,"性別","学年","資格","生年月日",null,null,null,null,null,null,"入学（転入）年月日",null,null,null,null,null,null,null,null,"種目","演武順","氏名","学校名","資格",null,"学校名","種目","演武NO","組NO","選手名","ふりがな","性別","学年","資格"]
["規定単独演武",null,null,null,null,null,null,null,{"$f":"PHONETIC(C10)","v":""},null,null,null,null,null,{"$f":"IF(C10=\"\",\"\",データテーブル!$H$2)","v":""},null,null,"平成",null,"年",null,"月",null,"日","令和",{"$f":"IF(P10=3,4,IF(P10=2,5,IF(P10=1,6,\"\")))","v":""},"年",{"$f":"IF(P10=\"\",\"\",4)","v":""},"月",{"$f":"IF(P10=\"\",\"\",10)","v":""},"日",null,null,"規定",null,{"$f":"C10","v":0},{"$f":"VLOOKUP($D$3,データテーブル!$A$2:$B$71,2,FALSE)","v":{"$error":"#N/A"}},{"$f":"Q10","v":0},null,{"$f":"VLOOKUP($D$3,データテーブル!$A$2:$B$71,2,FALSE)","v":{"$error":"#N/A"}},"規定単独演武",null,1,{"$f":"C10","v":0},{"$f":"I10","v":""},{"$f":"O10","v":""},{"$f":"P10","v":0},{"$f":"Q10","v":0}]
[null,null,null,null,null,null,null,null,{"$f":"PHONETIC(C11)","v":""},null,null,null,null,null,{"$f":"IF(C11=\"\",\"\",データテーブル!$H$2)","v":""},null,null,"平成",null,"年",null,"月",null,"日","令和",{"$f":"IF(P11=3,4,IF(P11=2,5,IF(P11=1,6,\"\")))","v":""},"年","","月","","日",null,null,"規定",null,{"$f":"C11","v":0},{"$f":"VLOOKUP($D$3,データテーブル!$A$2:$B$71,2,FALSE)","v":{"$error":"#N/A"}},{"$f":"Q11","v":0},null,{"$f":"VLOOKUP($D$3,データテーブル!$A$2:$B$71,2,FALSE)","v":{"$error":"#N/A"}},"規定単独演武",null,1,{"$f":"C11","v":0},{"$f":"I11","v":""},{"$f":"O11","v":""},{"$f":"P11","v":0},{"$f":"Q11","v":0}]
[null,null,null,null,null,null,null,null,"",null,null,null,null,null,{"$f":"IF(C12=\"\",\"\",データテーブル!$H$2)","v":""},null,null,"平成",null,"年",null,"月",null,"日","令和","","年","","月","","日",null,null,"規定",null,0,{"$f":"VLOOKUP($D$3,データテーブル!$A$2:$B$71,2,FALSE)","v":{"$error":"#N/A"}},0,null,{"$f":"VLOOKUP($D$3,データテーブル!$A$2:$B$71,2,FALSE)","v":{"$error":"#N/A"}},"規定単独演武",null,1,0,"","",0,0]
[null,null,null,null,null,null,null,null,"",null,null,null,null,null,{"$f":"IF(C13=\"\",\"\",データテーブル!$H$2)","v":""},null,null,"平成",null,"年",null,"月",null,"日","令和","","年","","月","","日",null,null,"規定",null,0,{"$f":"VLOOKUP($D$3,データテーブル!$A$2:$B$71,2,FALSE)","v":{"$error":"#N/A"}},0,null,{"$f":"VLOOKUP($D$3,データテーブル!$A$2:$B$71,2,FALSE)","v":{"$error":"#N/A"}},"規定単独演武",null,1,0,"","",0,0]
[null,null,null,null,null,null,null,null,"",null,null,null,null,null,{"$f":"IF(C14=\"\",\"\",データテーブル!$H$2)","v":""},null,null,"平成",null,"年",null,"月",null,"日","令和","","年","","月","","日",null,null,"規定",null,0,{"$f":"VLOOKUP($D$3,データテーブル!$A$2:$B$71,2,FALSE)","v":{"$error":"#N/A"}},0,null,{"$f":"VLOOKUP($D$3,データテーブル!$A$2:$B$71,2,FALSE)","v":{"$error":"#N/A"}},"規定単独演武",null,1,0,"","",0,0]
["自由単独演武",null,null,null,null,null,null,null,"",null,null,null,null,null,{"$f":"IF(C15=\"\",\"\",データテーブル!$H$2)","v":""},null,null,"平成",null,"年",null,"月",null,"日","令和","","年","","月","","日",null,null,"自由",null,0,{"$f":"VLOOKUP($D$3,データテーブル!$A$2:$B$71,2,FALSE)","v":{"$error":"#N/A"}},0,null,{"$f":"VLOOKUP($D$3,データテーブル!$A$2:$B$71,2,FALSE)","v":{"$error":"#N/A"}},"自由単独演武",null,1,0,"","",0,0]
[null,null,null,null,null,null,null,null,"",null,null,null,null,null,{"$f":"IF(C16=\"\",\"\",データテーブル!$H$2)","v":""},null,null,"平成",null,"年",null,"月",null,"日","令和","","年","","月","","日",null,null,"自由",null,0,{"$f":"VLOOKUP($D$3,データテーブル!$A$2:$B$71,2,FALSE)","v":{"$error":"#N/A"}},0,null,{"$f":"VLOOKUP($D$3,データテーブル!$A$2:$B$71,2,FALSE)","v":{"$error":"#N/A"}},"自由単独演武",null,1,0,"","",0,0]
[null,null,null,null,null,null,null,null,"",null,null,null,null,null,{"$f":"IF(C17=\"\",\"\",データテーブル!$H$2)","v":""},null,null,"平成",null,"年",null,"月",null,"日","令和","","年","","月","","日",null,null,"自由",null,0,{"$f":"VLOOKUP($D$3,データテーブル!$A$2:$B$71,2,FALSE)","v":{"$error":"#N/A"}},0,null,{"$f":"VLOOKUP($D$3,データテーブル!$A$2:$B$71,2,FALSE)","v":{"$error":"#N/A"}},"自由単独演武",null,1,0,"","",0,0]
[null,null,null,null,null,null,null,null,"",null,null,null,null,null,{"$f":"IF(C18=\"\",\"\",データテーブル!$H$2)","v":""},null,null,"平成",null,"年",null,"月",null,"日","令和","","年","","月","","日",null,null,"自由",null,0,{"$f":"VLOOKUP($D$3,データテーブル!$A$2:$B$71,2,FALSE)","v":{"$error":"#N/A"}},0,null,{"$f":"VLOOKUP($D$3,データテーブル!$A$2:$B$71,2,FALSE)","v":{"$error":"#N/A"}},"自由単独演武",null,1,0,"","",0,0]
[null,null,null,null,null,null,null,null,"",null,null,null,null,null,{"$f":"IF(C19=\"\",\"\",データテーブル!$H$2)","v":""},null,null,"平成",null,"年",null,"月",null,"日","令和","","年","","月","","日",null,null,"自由",null,0,{"$f":"VLOOKUP($D$3,データテーブル!$A$2:$B$71,2,FALSE)","v":{"$error":"#N/A"}},0,null,{"$f":"VLOOKUP($D$3,データテーブル!$A$2:$B$71,2,FALSE)","v":{"$error":"#N/A"}},"自由単独演武",null,1,0,"","",0,0]
["規定組演武",1,null,null,null,null,null,null,"",null,null,null,null,null,{"$f":"IF(C20=\"\",\"\",データテーブル!$H$2)","v":""},null,null,"平成",null,"年",null,"月",null,"日","令和","","年","","月","","日",null,null,"規定",null,0,{"$f":"VLOOKUP($D$3,データテーブル!$A$2:$B$71,2,FALSE)","v":{"$error":"#N/A"}},0,null,{"$f":"VLOOKUP($D$3,データテーブル!$A$2:$B$71,2,FALSE)","v":{"$error":"#N/A"}},"規定組演武",null,1,0,"","",0,0]
{"$rows_left_out":37}
{"sheet":"女子エントリー","index":1,"n_rows":56,"n_cols":48,"rows_kept":56,"cut":false,"hidden":false,"merged":[[0,0,0,25],[0,26,2,30],[2,0,2,1],[2,3,2,16],[3,0,4,1],[3,3,3,16],[3,17,4,19],[3,20,3,21],[3,22,3,30],[4,3,4,16],[6,22,6,30],[7,33,7,37],[7,39,7,47],[8,0,8,1],[8,2,8,7],[8,8,8,13],[8,17,8,23],[8,24,8,30],[4,20,4,21],[4,22,4,30],[5,0,5,1],[5,3,5,16],[5,17,6,19],[5,20,5,21],[5,22,5,30],[6,0,6,1],[6,3,6,16],[6,20,6,21],[13,8,13,13],[14,0,18,1],[14,2,14,7],[14,8,14,13],[15,2,15,7],[15,8,15,13],[16,2,16,7],[16,8,16,13],[17,2,17,7],[17,8,17,13],[9,0,13,1],[9,2,9,7],[9,8,9,13],[10,2,10,7],[10,8,10,13],[11,2,11,7],[11,8,11,13],[12,2,12,7],[12,8,12,13],[13,2,13,7],[18,2,18,7],[18,8,18,13],[19,0,28,0],[19,2,19,7],[19,8,19,13],[19,33,20,33],[23,2,23,7],[23,8,23,13],[23,33,24,33],[27,2,27,7],[19,36,20,36],[20,2,20,7],[20,8,20,13],[21,2,21,7],[21,8,21,13],[21,33,22,33],[21,36,22,36],[22,2,22,7],[22,8,22,13],[27,36,28,36],[28,2,28,7],[28,8,28,13],[29,0,38,0],[29,2,29,7],[29,8,29,13],[29,33,30,33],[29,36,30,36],[23,36,24,36],[24,2,24,7],[24,8,24,13],[25,2,25,7],[25,8,25,13],[25,33,26,33],[25,36,26,36],[26,2,26,7],[26,8,26,13],[30,2,30,7],[30,8,30,13],[31,2,31,7],[31,8,31,13],[31,33,32,33],[31,36,32,36],[32,2,32,7],[32,8,32,13],[27,8,27,13],[27,33,28,33],[35,2,35,7],[35,8,35,13],[35,33,36,33],[35,36,36,36],[36,2,36,7],[36,8,36,13],[33,2,33,7],[33,8,33,13],[33,33,34,33],[33,36,34,36],[34,2,34,7],[34,8,34,13],[42,2,42,7],[42,8,42,13],[43,2,43,7],[37,2,37,7],[37,8,37,13],[37,33,38,33],[37,36,38,36],[38,2,38,7],[38,8,38,13],[55,8,55,18],[55,19,55,20],[55,21,55,29],[0,32,0,48],[47,0,47,1],[47,2,47,7],[47,8,47,13],[49,0,49,30],[51,0,51,30],[53,1,53,2],[43,8,43,13],[44,2,44,7],[44,8,44,13],[45,2,45,7],[45,8,45,13],[46,2,46,7],[46,8,46,13],[39,0,46,0],[39,2,39,7],[39,8,39,13],[40,2,40,7],[40,8,40,13],[41,2,41,7],[41,8,41,13]]}
["３０　少林寺拳法競技　参加申込書　（新人）",null,null,null,null,null,null,null,null,null,null,null,null,null,null,null,null,null,null,null,null,null,null,null,null,null,"女子",null,null,null,null,null,"非表示セルあり"]
[]
["学校名"]
["学校所在地",null,"〒",{"$f":"IF($D$3=\"\",\"\",VLOOKUP($D$3,データテーブル!$A$2:$G$71,3,0))","v":""},null,null,null,null,null,null,null,null,null,null,null,null,null,"監　督",null,null,"氏名"]
[null,null,null,{"$f":"IF($D$3=\"\",\"\",VLOOKUP($D$3,データテーブル!$A$2:$G$71,4,0))","v":""},null,null,null,null,null,null,null,null,null,null,null,null,null,null,null,null,"ＴＥＬ"]
["ＴＥＬ",null,null,{"$f":"IF($D$3=\"\",\"\",VLOOKUP($D$3,データテーブル!$A$2:$G$71,5,0))","v":""},null,null,null,null,null,null,null,null,null,null,null,null,null,"引率教員",null,null,"氏名"]
["ＦＡＸ",null,null,{"$f":"IF($D$3=\"\",\"\",VLOOKUP($D$3,データテーブル!$A$2:$G$71,6,0))","v":""},null,null,null,null,null,null,null,null,null,null,null,null,null,null,null,null,"ＴＥＬ"]
[null,null,null,null,null,null,null,null,null,null,null,null,null,null,null,null,null,null,null,null,null,null,null,null,null,null,null,null,null,null,null,null,null,"監督会議　抽選会資料用",null,null,null,null,null,"出場選手マスター用"]
["出場種目",null,"選手名",null,null,null,null,null,"ふりがな",null,null,null,null,null,"性別","学年","資格","生年月日",null,null,null,null,null,null,"入学（転入）年月日",null,null,null,null,null,null,null,null,"種目","演武順","氏名","学校名","資格",null,"学校名","種目","演武NO","組NO","選手名","ふりがな","性別","学年","資格"]
["規定単独演武",null,null,null,null,null,null,null,{"$f":"PHONETIC(C10)","v":""},null,null,null,null,null,{"$f":"IF(C10=\"\",\"\",データテーブル!$H$2)","v":""},null,null,"平成",null,"年",null,"月",null,"日","令和",{"$f":"IF(P10=3,4,IF(P10=2,5,IF(P10=1,6,\"\")))","v":""},"年",{"$f":"IF(P10=\"\",\"\",4)","v":""},"月",{"$f":"IF(P10=\"\",\"\",10)","v":""},"日",null,null,"規定",null,{"$f":"C10","v":0},{"$f":"VLOOKUP($D$3,データテーブル!$A$2:$B$71,2,FALSE)","v":{"$error":"#N/A"}},{"$f":"Q10","v":0},null,{"$f":"VLOOKUP($D$3,データテーブル!$A$2:$B$71,2,FALSE)","v":{"$error":"#N/A"}},"規定単独演武",null,1,{"$f":"C10","v":0},{"$f":"I10","v":""},{"$f":"O10","v":""},{"$f":"P10","v":0},{"$f":"Q10","v":0}]
[null,null,null,null,null,null,null,null,"",null,null,null,null,null,{"$f":"IF(C11=\"\",\"\",データテーブル!$H$2)","v":""},null,null,"平成",null,"年",null,"月",null,"日","令和",{"$f":"IF(P11=3,4,IF(P11=2,5,IF(P11=1,6,\"\")))","v":""},"年","","月","","日",null,null,"規定",null,{"$f":"C11","v":0},{"$f":"VLOOKUP($D$3,データテーブル!$A$2:$B$71,2,FALSE)","v":{"$error":"#N/A"}},{"$f":"Q11","v":0},null,{"$f":"VLOOKUP($D$3,データテーブル!$A$2:$B$71,2,FALSE)","v":{"$error":"#N/A"}},"規定単独演武",null,1,{"$f":"C11","v":0},{"$f":"I11","v":""},{"$f":"O11","v":""},0,0]
[null,null,null,null,null,null,null,null,"",null,null,null,null,null,{"$f":"IF(C12=\"\",\"\",データテーブル!$H$2)","v":""},null,null,"平成",null,"年",null,"月",null,"日","令和","","年","","月","","日",null,null,"規定",null,0,{"$f":"VLOOKUP($D$3,データテーブル!$A$2:$B$71,2,FALSE)","v":{"$error":"#N/A"}},0,null,{"$f":"VLOOKUP($D$3,データテーブル!$A$2:$B$71,2,FALSE)","v":{"$error":"#N/A"}},"規定単独演武",null,1,0,"","",0,0]
[null,null,null,null,null,null,null,null,"",null,null,null,null,null,{"$f":"IF(C13=\"\",\"\",データテーブル!$H$2)","v":""},null,null,"平成",null,"年",null,"月",null,"日","令和","","年","","月","","日",null,null,"規定",null,0,{"$f":"VLOOKUP($D$3,データテーブル!$A$2:$B$71,2,FALSE)","v":{"$error":"#N/A"}},0,null,{"$f":"VLOOKUP($D$3,データテーブル!$A$2:$B$71,2,FALSE)","v":{"$error":"#N/A"}},"規定単独演武",null,1,0,"","",0,0]
[null,null,null,null,null,null,null,null,"",null,null,null,null,null,{"$f":"IF(C14=\"\",\"\",データテーブル!$H$2)","v":""},null,null,"平成",null,"年",null,"月",null,"日","令和","","年","","月","","日",null,null,"規定",null,0,{"$f":"VLOOKUP($D$3,データテーブル!$A$2:$B$71,2,FALSE)","v":{"$error":"#N/A"}},0,null,{"$f":"VLOOKUP($D$3,データテーブル!$A$2:$B$71,2,FALSE)","v":{"$error":"#N/A"}},"規定単独演武",null,1,0,"","",0,0]
["自由単独演武",null,null,null,null,null,null,null,"",null,null,null,null,null,{"$f":"IF(C15=\"\",\"\",データテーブル!$H$2)","v":""},null,null,"平成",null,"年",null,"月",null,"日","令和","","年","","月","","日",null,null,"自由",null,0,{"$f":"VLOOKUP($D$3,データテーブル!$A$2:$B$71,2,FALSE)","v":{"$error":"#N/A"}},0,null,{"$f":"VLOOKUP($D$3,データテーブル!$A$2:$B$71,2,FALSE)","v":{"$error":"#N/A"}},"自由単独演武",null,1,0,"","",0,0]
[null,null,null,null,null,null,null,null,"",null,null,null,null,null,{"$f":"IF(C16=\"\",\"\",データテーブル!$H$2)","v":""},null,null,"平成",null,"年",null,"月",null,"日","令和","","年","","月","","日",null,null,"自由",null,0,{"$f":"VLOOKUP($D$3,データテーブル!$A$2:$B$71,2,FALSE)","v":{"$error":"#N/A"}},0,null,{"$f":"VLOOKUP($D$3,データテーブル!$A$2:$B$71,2,FALSE)","v":{"$error":"#N/A"}},"自由単独演武",null,1,0,"","",0,0]
[null,null,null,null,null,null,null,null,"",null,null,null,null,null,{"$f":"IF(C17=\"\",\"\",データテーブル!$H$2)","v":""},null,null,"平成",null,"年",null,"月",null,"日","令和","","年","","月","","日",null,null,"自由",null,0,{"$f":"VLOOKUP($D$3,データテーブル!$A$2:$B$71,2,FALSE)","v":{"$error":"#N/A"}},0,null,{"$f":"VLOOKUP($D$3,データテーブル!$A$2:$B$71,2,FALSE)","v":{"$error":"#N/A"}},"自由単独演武",null,1,0,"","",0,0]
[null,null,null,null,null,null,null,null,"",null,null,null,null,null,{"$f":"IF(C18=\"\",\"\",データテーブル!$H$2)","v":""},null,null,"平成",null,"年",null,"月",null,"日","令和","","年","","月","","日",null,null,"自由",null,0,{"$f":"VLOOKUP($D$3,データテーブル!$A$2:$B$71,2,FALSE)","v":{"$error":"#N/A"}},0,null,{"$f":"VLOOKUP($D$3,データテーブル!$A$2:$B$71,2,FALSE)","v":{"$error":"#N/A"}},"自由単独演武",null,1,0,"","",0,0]
[null,null,null,null,null,null,null,null,"",null,null,null,null,null,{"$f":"IF(C19=\"\",\"\",データテーブル!$H$2)","v":""},null,null,"平成",null,"年",null,"月",null,"日","令和","","年","","月","","日",null,null,"自由",null,0,{"$f":"VLOOKUP($D$3,データテーブル!$A$2:$B$71,2,FALSE)","v":{"$error":"#N/A"}},0,null,{"$f":"VLOOKUP($D$3,データテーブル!$A$2:$B$71,2,FALSE)","v":{"$error":"#N/A"}},"自由単独演武",null,1,0,"","",0,0]
["規定組演武",1,null,null,null,null,null,null,"",null,null,null,null,null,{"$f":"IF(C20=\"\",\"\",データテーブル!$H$2)","v":""},null,null,"平成",null,"年",null,"月",null,"日","令和","","年","","月","","日",null,null,"規定",null,0,{"$f":"VLOOKUP($D$3,データテーブル!$A$2:$B$71,2,FALSE)","v":{"$error":"#N/A"}},0,null,{"$f":"VLOOKUP($D$3,データテーブル!$A$2:$B$71,2,FALSE)","v":{"$error":"#N/A"}},"規定組演武",null,1,0,"","",0,0]
{"$rows_left_out":37}
{"sheet":"参加人数集計","index":2,"n_rows":7,"n_cols":5,"rows_kept":7,"cut":false,"hidden":false,"merged":[[0,0,1,3]]}
[{"$f":"IF(男子エントリー!$D$3=\"\",#REF!,男子エントリー!$D$3)","v":{"$error":"#REF!"}}]
[]
[null,"男子","女子","合計","備　　　考"]
["単独演武",{"$f":"COUNTA(男子エントリー!$C$10:$H$19)","v":0},{"$f":"COUNTA(女子エントリー!$C$10:$H$19)","v":0},{"$f":"SUM(B4:C4)","v":0}]
["組演武",{"$f":"COUNTA(男子エントリー!$C$20:$H$39)","v":0},{"$f":"COUNTA(女子エントリー!$C$20:$H$39)","v":0},0]
["団体演武",{"$f":"COUNTA(男子エントリー!$C$40:$H$47)-COUNTIF(男子エントリー!$AF$40:$AF$47,\"○\")","v":0},{"$f":"COUNTA(女子エントリー!$C$40:$H$47)-COUNTIF(女子エントリー!$AF$40:$AF$47,\"○\")","v":0},0,"団体演武のエントリー数から重複人数を引いた数になります。"]
["合計",{"$f":"SUM(B4:B6)","v":0},{"$f":"SUM(C4:C6)","v":0},{"$f":"SUM(D4:D6)","v":0},"実参加人数です。この人数で参加料が請求されます。"]

{"sheet":"データテーブル","index":3,"n_rows":71,"n_cols":11,"rows_kept":71,"cut":false,"hidden":false,"merged":[[53,6,54,6],[56,6,58,6]]}
["学校名","略称","郵便番号","住所","ＴＥＬ","ＦＡＸ","校長名","性別","学年","資格","重複"]
["宮崎県立延岡工業高等学校","延岡工業","882-0863","延岡市緑ヶ丘1丁目8-1","0982-33-3323","0982-33-3324","山　内　武　幸","男",1,"三段","○"]
["宮崎県立都城工業高等学校","都城工業","885-0084","都城市五十町2400番地","0986-22-4349","0986-22-5877","香　川　健　二","女",2,"二段"]
["私立都城高等学校","都城","885-0095","都城市簑原町7916番地","0986-23-2477","0986-26-5220","久　保　壮　史",null,3,"初段"]
["国立都城工業高等専門学校","都城高専","885-8567","都城市吉尾町473番地の1","0986-47-1133","0986-47-1143","田　村　隆　弘",null,null,"１級"]
["*****************************",null,null,null,null,null,null,null,null,"２級"]
["宮崎県立五ヶ瀬中等教育学校","五ヶ瀬","882-1203","五ヶ瀬町大字三ヶ所9468-30","0982-\n82-1255","0982-\n82-1266","　平　　和　正",null,null,"３級"]
["宮崎県立高千穂高等学校","高千穂","882-1101","高千穂町大字三田井1234","0982-\n72-3111","0982-\n72-3703","長　友　美　紀",null,null,"４級"]
["私立延岡学園高等学校","延岡学園","882-0001","延岡市大峡町7820番地","0982-\n33-3227","0982-\n35-1025","柳　田　光　寛",null,null,"５級"]
["宮崎県立延岡商業高等学校","延岡商業","882-0007","延岡市桜ヶ丘3丁目7122番地","0982-\n32-6348","0982-\n32-6349","堀　切　康　博",null,null,"６級"]
["宮崎県立延岡星雲高等学校","延岡星雲","882-0023","延岡市牧町4722番地","0982-\n31-2491","0982-\n35-6026","宮　﨑　真　司",null,null,"見習い"]
["宮崎県立延岡高等学校","延岡","882-0837","延岡市古城町3-233","0982-\n32-5331","0982-\n33-7600","澁　谷　好　一"]
["私立聖心ウルスラ学園高等学校","ウルスラ","882-0863","延岡市緑ヶ丘3丁目7番21号","0982-\n33-3472","0982-\n32-2152","安　藤　真　二"]
["宮崎県立門川高等学校","門川","889-0611","門川町大字門川尾末2680","0982-\n63-1336","0982-\n63-5194","村　社　貞　利"]
["宮崎県立富島高等学校","富島","883-0052","日向市鶴町3丁目1番43号","0982-\n52-2158","0982-\n54-9510","小　川　晴　彦"]
["宮崎県立日向高等学校","日向","883-0021","日向市大字財光寺6265番地","0982-\n54-3400","0982-\n54-3759","吉　玉　　拓"]
["宮崎県立日向工業高等学校","日向工業","883-0022","日向市大字平岩8750番地","0982-\n57-1411","0982-\n57-2146","二　見　宗　英"]
["宮崎県立高鍋農業高等学校","高鍋農業","884-0006","児湯郡高鍋町上江1339-2","0983-\n23-0002","0983-\n23-5542","髙　橋　　寛"]
["宮崎県立高鍋高等学校","高鍋","884-0002","児湯郡高鍋町大字北高鍋4262","0983-\n23-0005","0983-\n23-5096","山　尾　典　子"]
["宮崎県立妻高等学校","妻","881-0003","西都市大字右松2330番地","0983-\n43-0005","0983-\n43-0004","三　浦　正　貴"]
{"$rows_left_out":51}